Reaction Details
TargetReceptor tyrosine-protein kinase erbB-2
LigandBDBM13917
Substrate/Competitorn/a
Meas. Tech.ChEMBL_321451 (CHEMBL880259)
IC50 9700.0±n/a nM
Citation Fink, BEVite, GDMastalerz, HKadow, JFKim, SHLeavitt, KJDu, KCrews, DMitt, TWong, TWHunt, JTVyas, DMTokarski, JS New dual inhibitors of EGFR and HER2 protein tyrosine kinases. Bioorg Med Chem Lett15:4774-9 (2005) 
 
Receptor tyrosine-protein kinase erbB-2
Name:Receptor tyrosine-protein kinase erbB-2
Type:n/a
Mol. Mass.:137894.47
Organism:Homo sapiens (Human)
Description:P04626
Residue:1255
BDBM13917
NameBDBM13917
Synonyms:1-benzyl-N-{5-ethyl-6-[(ethylamino)methyl]pyrrolo[1,2-a][1,2,4]triazin-4-yl}-1H-indazol-5-amine pyrrolo[2,1-f][1,2,4]triazine analog 11
TypeSmall organic molecule
Emp. Form.C25H27N7
Mol. Mass.425.5288
SMILESCCNCc1cn2ncnc(Nc3ccc4n(Cc5ccccc5)ncc4c3)c2c1CC