Reaction Details
TargetReceptor tyrosine-protein kinase erbB-2
LigandBDBM13915
Substrate/Competitorn/a
Meas. Tech.ChEMBL_321451 (CHEMBL880259)
IC50 170±n/a nM
Citation Fink, BEVite, GDMastalerz, HKadow, JFKim, SHLeavitt, KJDu, KCrews, DMitt, TWong, TWHunt, JTVyas, DMTokarski, JS New dual inhibitors of EGFR and HER2 protein tyrosine kinases. Bioorg Med Chem Lett15:4774-9 (2005) 
 
Receptor tyrosine-protein kinase erbB-2
Name:Receptor tyrosine-protein kinase erbB-2
Type:n/a
Mol. Mass.:137894.47
Organism:Homo sapiens (Human)
Description:P04626
Residue:1255
BDBM13915
NameBDBM13915
Synonyms:CHEMBL372523 pyrrolo[2,1-f][1,2,4]triazine analog 9a
TypeSmall organic molecule
Emp. Form.C30H27N7O2
Mol. Mass.517.5811
SMILESCCc1c(NC(=O)OCc2ccccc2)cn2ncnc(Nc3ccc4n(Cc5ccccc5)ncc4c3)c12