Reaction Details
TargetEpidermal growth factor receptor
LigandBDBM13915
Substrate/Competitorn/a
Meas. Tech.ChEMBL_321412 (CHEMBL881943)
IC50 210±n/a nM
Citation Fink, BEVite, GDMastalerz, HKadow, JFKim, SHLeavitt, KJDu, KCrews, DMitt, TWong, TWHunt, JTVyas, DMTokarski, JS New dual inhibitors of EGFR and HER2 protein tyrosine kinases. Bioorg Med Chem Lett15:4774-9 (2005) 
 
Epidermal growth factor receptor
Name:Epidermal growth factor receptor
Type:Receptor Kinase Domain
Mol. Mass.:134279.59
Organism:Homo sapiens (Human)
Description:P00533
Residue:1210
BDBM13915
NameBDBM13915
Synonyms:CHEMBL372523 pyrrolo[2,1-f][1,2,4]triazine analog 9a
TypeSmall organic molecule
Emp. Form.C30H27N7O2
Mol. Mass.517.5811
SMILESCCc1c(NC(=O)OCc2ccccc2)cn2ncnc(Nc3ccc4n(Cc5ccccc5)ncc4c3)c12