Reaction Details
TargetMAP kinase-activated protein kinase 2
LigandBDBM13923
Substrate/Competitorn/a
Meas. Tech.ChEMBL_321443 (CHEMBL880251)
IC50>25000±n/a nM
Citation Fink, BEVite, GDMastalerz, HKadow, JFKim, SHLeavitt, KJDu, KCrews, DMitt, TWong, TWHunt, JTVyas, DMTokarski, JS New dual inhibitors of EGFR and HER2 protein tyrosine kinases. Bioorg Med Chem Lett15:4774-9 (2005) 
 
MAP kinase-activated protein kinase 2
Name:MAP kinase-activated protein kinase 2
Type:Serine/threonine-protein kinase
Mol. Mass.:45579.87
Organism:Homo sapiens (Human)
Description:P49137
Residue:400
BDBM13923
NameBDBM13923
Synonyms:2-(1H-imidazol-1-yl)ethyl N-{4-[(1-benzyl-1H-indazol-5-yl)amino]-5-ethylpyrrolo[1,2-a][1,2,4]triazin-6-yl}carbamate pyrrolo[2,1-f][1,2,4]triazine analog 9b
TypeSmall organic molecule
Emp. Form.C28H27N9O2
Mol. Mass.521.5731
SMILESCCc1c(NC(=O)OCCn2ccnc2)cn2ncnc(Nc3ccc4n(Cc5ccccc5)ncc4c3)c12