Reaction Details
TargetEpidermal growth factor receptor
LigandBDBM13913
Substrate/Competitorn/a
Meas. Tech.ChEMBL_321412 (CHEMBL881943)
IC50 70.0±n/a nM
Citation Fink, BEVite, GDMastalerz, HKadow, JFKim, SHLeavitt, KJDu, KCrews, DMitt, TWong, TWHunt, JTVyas, DMTokarski, JS New dual inhibitors of EGFR and HER2 protein tyrosine kinases. Bioorg Med Chem Lett15:4774-9 (2005) 
 
Epidermal growth factor receptor
Name:Epidermal growth factor receptor
Type:Receptor Kinase Domain
Mol. Mass.:134279.59
Organism:Homo sapiens (Human)
Description:P00533
Residue:1210
BDBM13913
NameBDBM13913
Synonyms:4-[(1-benzyl-1H-indazol-5-yl)amino]-5-ethyl-N-methylpyrrolo[1,2-a][1,2,4]triazine-6-carboxamide pyrrolo[2,1-f][1,2,4]triazine analog 7b
TypeSmall organic molecule
Emp. Form.C24H23N7O
Mol. Mass.425.4857
SMILESCCc1c(cn2ncnc(Nc3ccc4n(Cc5ccccc5)ncc4c3)c12)C(=O)NC