Reaction Details
TargetEpidermal growth factor receptor
LigandBDBM13921
Substrate/Competitorn/a
Meas. Tech.ChEMBL_321412 (CHEMBL881943)
IC50 40±n/a nM
Citation Fink, BEVite, GDMastalerz, HKadow, JFKim, SHLeavitt, KJDu, KCrews, DMitt, TWong, TWHunt, JTVyas, DMTokarski, JS New dual inhibitors of EGFR and HER2 protein tyrosine kinases. Bioorg Med Chem Lett15:4774-9 (2005) 
 
Epidermal growth factor receptor
Name:Epidermal growth factor receptor
Type:Receptor Kinase Domain
Mol. Mass.:134279.59
Organism:Homo sapiens (Human)
Description:P00533
Residue:1210
BDBM13921
NameBDBM13921
Synonyms:4-[(1-benzyl-1H-indazol-5-yl)amino]-5-ethyl-N-[3-(1H-imidazol-1-yl)propyl]pyrrolo[1,2-a][1,2,4]triazine-6-carboxamide pyrrolo[2,1-f][1,2,4]triazine analog 7d
TypeSmall organic molecule
Emp. Form.C29H29N9O
Mol. Mass.519.6003
SMILESCCc1c(cn2ncnc(Nc3ccc4n(Cc5ccccc5)ncc4c3)c12)C(=O)NCCCn1ccnc1