Reaction Details
TargetMetabotropic glutamate receptor 5
LigandBDBM50172125
Substrate/Competitorn/a
Meas. Tech.ChEMBL_320949 (CHEMBL882468)
Ki 35±n/a nM
Citation Chua, PCNagasawa, JYBleicher, LSMunoz, BSchweiger, EJTehrani, LAnderson, JJCramer, MChung, JGreen, MDKing, CDReyes-Manalo, GCosford, ND Cyclohexenyl- and dehydropiperidinyl-alkynyl pyridines as potent metabotropic glutamate subtype 5 (mGlu5) receptor antagonists. Bioorg Med Chem Lett15:4589-93 (2005) 
 
Metabotropic glutamate receptor 5
Name:Metabotropic glutamate receptor 5
Type:Enzyme
Mol. Mass.:131900.14
Organism:Rattus norvegicus (Rat)
Description:P31424
Residue:1203
BDBM50172125
NameBDBM50172125
Synonyms:CHEMBL194407 | Pyridin-3-yl-(4-pyridin-2-ylethynyl-cyclohex-3-enyl)-amine
TypeSmall organic molecule
Emp. Form.C18H17N3
Mol. Mass.275.3477
SMILESC1CC(=CCC1Nc1cccnc1)C#Cc1ccccn1