Reaction Details
TargetMetabotropic glutamate receptor 5
LigandBDBM50172131
Substrate/Competitorn/a
Meas. Tech.ChEMBL_320949 (CHEMBL882468)
Ki 21±n/a nM
Citation Chua, PCNagasawa, JYBleicher, LSMunoz, BSchweiger, EJTehrani, LAnderson, JJCramer, MChung, JGreen, MDKing, CDReyes-Manalo, GCosford, ND Cyclohexenyl- and dehydropiperidinyl-alkynyl pyridines as potent metabotropic glutamate subtype 5 (mGlu5) receptor antagonists. Bioorg Med Chem Lett15:4589-93 (2005) 
 
Metabotropic glutamate receptor 5
Name:Metabotropic glutamate receptor 5
Type:Enzyme
Mol. Mass.:131900.14
Organism:Rattus norvegicus (Rat)
Description:P31424
Residue:1203
BDBM50172131
NameBDBM50172131
Synonyms:2-{[3-(pyridin-4-yloxy)cyclohex-1-en-1-yl]ethynyl}pyridine | CHEMBL194246
TypeSmall organic molecule
Emp. Form.C18H16N2O
Mol. Mass.276.3324
SMILESC1CC(Oc2ccncc2)C=C(C1)C#Cc1ccccn1