Reaction Details
TargetMetabotropic glutamate receptor 5
LigandBDBM50172136
Substrate/Competitorn/a
Meas. Tech.ChEMBL_322406 (CHEMBL871882)
IC50 12±n/a nM
Citation Chua, PCNagasawa, JYBleicher, LSMunoz, BSchweiger, EJTehrani, LAnderson, JJCramer, MChung, JGreen, MDKing, CDReyes-Manalo, GCosford, ND Cyclohexenyl- and dehydropiperidinyl-alkynyl pyridines as potent metabotropic glutamate subtype 5 (mGlu5) receptor antagonists. Bioorg Med Chem Lett15:4589-93 (2005) 
 
Metabotropic glutamate receptor 5
Name:Metabotropic glutamate receptor 5
Type:Enzyme
Mol. Mass.:132484.72
Organism:Homo sapiens (Human)
Description:n/a
Residue:1212
BDBM50172136
NameBDBM50172136
Synonyms:4-Pyridin-2-ylethynyl-3,6-dihydro-2H-pyridine-1-carboxylic acid benzyl ester | CHEMBL194197
TypeSmall organic molecule
Emp. Form.C20H18N2O2
Mol. Mass.318.3691
SMILESO=C(OCc1ccccc1)N1CCC(=CC1)C#Cc1ccccn1