Reaction Details
TargetDipeptidyl peptidase 4
LigandBDBM50140541
Substrate/Competitorn/a
Meas. Tech.ChEMBL_320814 (CHEMBL872349)
Ki 28±n/a nM
Citation Hulin, BCabral, SLopaze, MGVan Volkenburg, MAAndrews, KMParker, JC New fluorinated pyrrolidine and azetidine amides as dipeptidyl peptidase IV inhibitors. Bioorg Med Chem Lett15:4770-3 (2005) 
 
Dipeptidyl peptidase 4
Name:Dipeptidyl peptidase 4
Type:Enzyme
Mol. Mass.:88271.01
Organism:Homo sapiens (Human)
Description:P27487
Residue:766
BDBM50140541
NameBDBM50140541
Synonyms:(S)-2-Amino-2-cyclohexyl-1-(3,3-difluoro-pyrrolidin-1-yl)-ethanone CHEMBL280658
TypeSmall organic molecule
Emp. Form.C12H20F2N2O
Mol. Mass.246.2968
SMILESN[C@@H](C1CCCCC1)C(=O)N1CCC(F)(F)C1