Reaction Details
TargetDipeptidyl peptidase 4
LigandBDBM50172143
Substrate/Competitorn/a
Meas. Tech.ChEMBL_320814 (CHEMBL872349)
Ki 109±n/a nM
Citation Hulin, BCabral, SLopaze, MGVan Volkenburg, MAAndrews, KMParker, JC New fluorinated pyrrolidine and azetidine amides as dipeptidyl peptidase IV inhibitors. Bioorg Med Chem Lett15:4770-3 (2005) 
 
Dipeptidyl peptidase 4
Name:Dipeptidyl peptidase 4
Type:Enzyme
Mol. Mass.:88271.01
Organism:Homo sapiens (Human)
Description:P27487
Residue:766
BDBM50172143
NameBDBM50172143
Synonyms:(S)-2-Amino-2-cyclohexyl-1-(3-fluoro-azetidin-1-yl)-ethanone | CHEMBL366250
TypeSmall organic molecule
Emp. Form.C11H19FN2O
Mol. Mass.214.2798
SMILESN[C@@H](C1CCCCC1)C(=O)N1CC(F)C1