Reaction Details
TargetCannabinoid receptor 2
LigandBDBM50172163
Substrate/Competitorn/a
Meas. Tech.ChEMBL_320783 (CHEMBL884738)
Ki 0.6±n/a nM
Citation Shankar, BBLavey, BJZhou, GSpitler, JATong, LRizvi, RYang, DYWolin, RKozlowski, JAShih, NYWu, JHipkin, RWGonsiorek, WLunn, CA Triaryl bis-sulfones as cannabinoid-2 receptor ligands: SAR studies. Bioorg Med Chem Lett15:4417-20 (2005) 
 
Cannabinoid receptor 2
Name:Cannabinoid receptor 2
Type:G Protein-Coupled Receptor (GPCR)
Mol. Mass.:39690.94
Organism:Homo sapiens (Human)
Description:P34972
Residue:360
BDBM50172163
NameBDBM50172163
Synonyms:CHEMBL197955 | N-{(S)-1-[4-(2-Benzenesulfonyl-4-methoxy-benzenesulfonyl)-phenyl]-ethyl}-methanesulfonamide
TypeSmall organic molecule
Emp. Form.C22H23NO7S3
Mol. Mass.509.616
SMILESCOc1ccc(c(c1)S(=O)(=O)c1ccccc1)S(=O)(=O)c1ccc(cc1)[C@H](C)NS(C)(=O)=O