Reaction Details
TargetCannabinoid receptor 2
LigandBDBM50172164
Substrate/Competitorn/a
Meas. Tech.ChEMBL_320783 (CHEMBL884738)
Ki 0.6±n/a nM
Citation Shankar, BBLavey, BJZhou, GSpitler, JATong, LRizvi, RYang, DYWolin, RKozlowski, JAShih, NYWu, JHipkin, RWGonsiorek, WLunn, CA Triaryl bis-sulfones as cannabinoid-2 receptor ligands: SAR studies. Bioorg Med Chem Lett15:4417-20 (2005) 
 
Cannabinoid receptor 2
Name:Cannabinoid receptor 2
Type:G Protein-Coupled Receptor (GPCR)
Mol. Mass.:39690.94
Organism:Homo sapiens (Human)
Description:P34972
Residue:360
BDBM50172164
NameBDBM50172164
Synonyms:CHEMBL199048 | N-((S)-1-{4-[4-Methoxy-2-(4-methoxy-benzenesulfonyl)-benzyl]-phenyl}-ethyl)-methanesulfonamide
TypeSmall organic molecule
Emp. Form.C24H27NO6S2
Mol. Mass.489.604
SMILESCOc1ccc(cc1)S(=O)(=O)c1cc(OC)ccc1Cc1ccc(cc1)[C@H](C)NS(C)(=O)=O