Reaction Details
TargetOxysterols receptor LXR-beta
LigandBDBM50167697
Substrate/Competitorn/a
Meas. Tech.ChEMBL_321167 (CHEMBL882896)
IC50 1±n/a nM
Citation Liu, WChen, SDropinski, JColwell, LRobins, MSzymonifka, MHayes, NSharma, NMacNaul, KHernandez, MBurton, CSparrow, CPMenke, JGSingh, SB Design, synthesis, and structure-activity relationship of podocarpic acid amides as liver X receptor agonists for potential treatment of atherosclerosis. Bioorg Med Chem Lett15:4574-8 (2005) 
 
Oxysterols receptor LXR-beta
Name:Oxysterols receptor LXR-beta
Type:Enzyme Catalytic Domain
Mol. Mass.:50978.79
Organism:Homo sapiens (Human)
Description:P55055
Residue:460
BDBM50167697
NameBDBM50167697
Synonyms:(4aR,9S)-6-Hydroxy-1,4a-dimethyl-1,2,3,4,4a,9,10,10a-octahydro-phenanthrene-1-carboxylic acid ((1S,4aS,10aR)-6-hydroxy-1,4a-dimethyl-1,2,3,4,4a,9,10,10a-octahydro-phenanthrene-1-carbonyl)-amide CHEMBL365544
TypeSmall organic molecule
Emp. Form.C34H43NO4
Mol. Mass.529.7095
SMILESCC1(CCC[C@@]2(C)[C@H]1CCc1ccc(O)cc21)C(=O)NC(=O)[C@@]1(C)CCC[C@@]2(C)[C@H]1CCc1ccc(O)cc21