Reaction Details
TargetOxysterols receptor LXR-beta
LigandBDBM50167694
Substrate/Competitorn/a
Meas. Tech.ChEMBL_321167 (CHEMBL882896)
IC50 2±n/a nM
Citation Liu, WChen, SDropinski, JColwell, LRobins, MSzymonifka, MHayes, NSharma, NMacNaul, KHernandez, MBurton, CSparrow, CPMenke, JGSingh, SB Design, synthesis, and structure-activity relationship of podocarpic acid amides as liver X receptor agonists for potential treatment of atherosclerosis. Bioorg Med Chem Lett15:4574-8 (2005) 
 
Oxysterols receptor LXR-beta
Name:Oxysterols receptor LXR-beta
Type:Enzyme Catalytic Domain
Mol. Mass.:50978.79
Organism:Homo sapiens (Human)
Description:P55055
Residue:460
BDBM50167694
NameBDBM50167694
Synonyms:2,6-dimethyl-13-methylcarbonyloxy-(2S)-tricyclo[8.4.0.02,7]tetradeca-1(10),11,13-triene-6-carboxylic 2,6-dimethyl-13-methylcarbonyloxy-(2S,6S,7R)-tricyclo[8.4.0.02,7]tetradeca-1(14),10,12-triene-6-carboxylic anhydride CHEMBL191965
TypeSmall organic molecule
Emp. Form.C38H46O7
Mol. Mass.614.7676
SMILESCC(=O)Oc1ccc2CC[C@H]3C(C)(CCC[C@]3(C)c2c1)C(=O)OC(=O)[C@@]1(C)CCC[C@@]2(C)[C@H]1CCc1ccc(OC(C)=O)cc21