Reaction Details
Target5-hydroxytryptamine receptor 6
LigandBDBM50172261
Substrate/Competitorn/a
Meas. Tech.ChEMBL_320876 (CHEMBL884801)
Ki 3±n/a nM
Citation Cole, DCLennox, WJStock, JREllingboe, JWMazandarani, HSmith, DLZhang, GTawa, GJSchechter, LE Conformationally constrained N1-arylsulfonyltryptamine derivatives as 5-HT6 receptor antagonists. Bioorg Med Chem Lett15:4780-5 (2005) 
 
5-hydroxytryptamine receptor 6
Name:5-hydroxytryptamine receptor 6
Type:G Protein-Coupled Receptor (GPCR)
Mol. Mass.:46968.43
Organism:Homo sapiens (Human)
Description:P50406
Residue:440
BDBM50172261
NameBDBM50172261
Synonyms:1-(5-Bromo-thiophene-2-sulfonyl)-3-((S)-1-methyl-pyrrolidin-2-ylmethyl)-1H-indole | CHEMBL434932
TypeSmall organic molecule
Emp. Form.C18H19BrN2O2S2
Mol. Mass.439.39
SMILESCN1CCC[C@H]1Cc1cn(c2ccccc12)S(=O)(=O)c1ccc(Br)s1