Reaction Details
Target5-hydroxytryptamine receptor 6
LigandBDBM50172305
Substrate/Competitorn/a
Meas. Tech.ChEMBL_322374 (CHEMBL856238)
IC50 43.6±n/a nM
Citation Cole, DCLennox, WJStock, JREllingboe, JWMazandarani, HSmith, DLZhang, GTawa, GJSchechter, LE Conformationally constrained N1-arylsulfonyltryptamine derivatives as 5-HT6 receptor antagonists. Bioorg Med Chem Lett15:4780-5 (2005) 
 
5-hydroxytryptamine receptor 6
Name:5-hydroxytryptamine receptor 6
Type:G Protein-Coupled Receptor (GPCR)
Mol. Mass.:46968.43
Organism:Homo sapiens (Human)
Description:P50406
Residue:440
BDBM50172305
NameBDBM50172305
Synonyms:1-(4-Iodo-benzenesulfonyl)-3-(1-methyl-pyrrolidin-3-yl)-1H-indole | CHEMBL193450
TypeSmall organic molecule
Emp. Form.C19H19IN2O2S
Mol. Mass.466.336
SMILESCN1CCC(C1)c1cn(c2ccccc12)S(=O)(=O)c1ccc(I)cc1