Reaction Details
Target5-hydroxytryptamine receptor 6
LigandBDBM50172311
Substrate/Competitorn/a
Meas. Tech.ChEMBL_320876 (CHEMBL884801)
Ki 3±n/a nM
Citation Cole, DCLennox, WJStock, JREllingboe, JWMazandarani, HSmith, DLZhang, GTawa, GJSchechter, LE Conformationally constrained N1-arylsulfonyltryptamine derivatives as 5-HT6 receptor antagonists. Bioorg Med Chem Lett15:4780-5 (2005) 
 
5-hydroxytryptamine receptor 6
Name:5-hydroxytryptamine receptor 6
Type:G Protein-Coupled Receptor (GPCR)
Mol. Mass.:46968.43
Organism:Homo sapiens (Human)
Description:P50406
Residue:440
BDBM50172311
NameBDBM50172311
Synonyms:5-[3-(1-Benzyl-pyrrolidin-3-yl)-indole-1-sulfonyl]-4-methyl-thiazol-2-ylamine | CHEMBL196466
TypeSmall organic molecule
Emp. Form.C23H24N4O2S2
Mol. Mass.452.592
SMILESCc1nc(N)sc1S(=O)(=O)n1cc(C2CCN(Cc3ccccc3)C2)c2ccccc12