Reaction Details
Target5-hydroxytryptamine receptor 6
LigandBDBM50172310
Substrate/Competitorn/a
Meas. Tech.ChEMBL_320876 (CHEMBL884801)
Ki 1.5±n/a nM
Citation Cole, DCLennox, WJStock, JREllingboe, JWMazandarani, HSmith, DLZhang, GTawa, GJSchechter, LE Conformationally constrained N1-arylsulfonyltryptamine derivatives as 5-HT6 receptor antagonists. Bioorg Med Chem Lett15:4780-5 (2005) 
 
5-hydroxytryptamine receptor 6
Name:5-hydroxytryptamine receptor 6
Type:G Protein-Coupled Receptor (GPCR)
Mol. Mass.:46968.43
Organism:Homo sapiens (Human)
Description:P50406
Residue:440
BDBM50172310
NameBDBM50172310
Synonyms:(1-Benzenesulfonyl-5-methoxy-1H-indol-3-ylmethyl)-dimethyl-amine | CHEMBL372364
TypeSmall organic molecule
Emp. Form.C18H20N2O3S
Mol. Mass.344.428
SMILESCOc1ccc2n(cc(CN(C)C)c2c1)S(=O)(=O)c1ccccc1