Reaction Details
Target5-hydroxytryptamine receptor 6
LigandBDBM50172270
Substrate/Competitorn/a
Meas. Tech.ChEMBL_320876 (CHEMBL884801)
Ki 5±n/a nM
Citation Cole, DCLennox, WJStock, JREllingboe, JWMazandarani, HSmith, DLZhang, GTawa, GJSchechter, LE Conformationally constrained N1-arylsulfonyltryptamine derivatives as 5-HT6 receptor antagonists. Bioorg Med Chem Lett15:4780-5 (2005) 
 
5-hydroxytryptamine receptor 6
Name:5-hydroxytryptamine receptor 6
Type:G Protein-Coupled Receptor (GPCR)
Mol. Mass.:46968.43
Organism:Homo sapiens (Human)
Description:P50406
Residue:440
BDBM50172270
NameBDBM50172270
Synonyms:3-((S)-1-Methyl-pyrrolidin-2-ylmethyl)-1-(toluene-4-sulfonyl)-1H-indole | CHEMBL370215
TypeSmall organic molecule
Emp. Form.C21H24N2O2S
Mol. Mass.368.492
SMILESCN1CCC[C@H]1Cc1cn(c2ccccc12)S(=O)(=O)c1ccc(C)cc1