Reaction Details
TargetCytochrome P450 3A4
LigandBDBM27879
Substrate/Competitorn/a
Meas. Tech.ChEMBL_321431 (CHEMBL880239)
IC50 5300±n/a nM
Citation Wittman, MCarboni, JAttar, RBalasubramanian, BBalimane, PBrassil, PBeaulieu, FChang, CClarke, WDell, JEummer, JFrennesson, DGottardis, MGreer, AHansel, SHurlburt, WJacobson, BKrishnananthan, SLee, FYLi, ALin, TALiu, POuellet, CSang, XSaulnier, MGStoffan, KSun, YVelaparthi, UWong, HYang, ZZimmermann, KZoeckler, MVyas, D Discovery of a (1H-benzoimidazol-2-yl)-1H-pyridin-2-one (BMS-536924) inhibitor of insulin-like growth factor I receptor kinase with in vivo antitumor activity. J Med Chem48:5639-43 (2005) 
 
Cytochrome P450 3A4
Name:Cytochrome P450 3A4
Type:Enzyme
Mol. Mass.:57349.57
Organism:Homo sapiens (Human)
Description:n/a
Residue:503
BDBM27879
NameBDBM27879
Synonyms:4-{[(2S)-2-(3-chlorophenyl)-2-hydroxyethyl]amino}-3-[4-methyl-6-(morpholin-4-yl)-1H-1,3-benzodiazol-2-yl]-1,2-dihydropyridin-2-one CHEMBL401930 | US10710978, Compound BMS536924
TypeSmall organic molecule
Emp. Form.C25H26ClN5O3
Mol. Mass.479.959
SMILESCc1cc(cc2[nH]c(nc12)-c1c(NC[C@@H](O)c2cccc(Cl)c2)cc[nH]c1=O)N1CCOCC1