Reaction Details
TargetD(3) dopamine receptor
LigandBDBM50172421
Substrate/Competitorn/a
Meas. Tech.ChEMBL_321257 (CHEMBL881882)
IC50 2300±n/a nM
Citation Ulven, TFrimurer, TMReceveur, JMLittle, PBRist, ONørregaard, PKHögberg, T 6-Acylamino-2-aminoquinolines as potent melanin-concentrating hormone 1 receptor antagonists. Identification, structure-activity relationship, and investigation of binding mode. J Med Chem48:5684-97 (2005) 
 
D(3) dopamine receptor
Name:D(3) dopamine receptor
Type:n/a
Mol. Mass.:44243.43
Organism:Homo sapiens (Human)
Description:n/a
Residue:400
BDBM50172421
NameBDBM50172421
Synonyms:(E)-N-{2-[(2-Dimethylamino-ethyl)-methyl-amino]-4-methyl-quinolin-6-yl}-3-(4-trifluoromethoxy-phenyl)-acrylamide N-(2-((2-(dimethylamino)ethyl)(methyl)amino)-4-methylquinolin-6-yl)-3-(4-(trifluoromethoxy)phenyl)acrylamide
TypeSmall organic molecule
Emp. Form.C25H27F3N4O2
Mol. Mass.472.5027
SMILESCN(C)CCN(C)c1cc(C)c2cc(NC(=O)\C=C\c3ccc(OC(F)(F)F)cc3)ccc2n1