Reaction Details
TargetMelanin-concentrating hormone receptor 2
LigandBDBM50172425
Substrate/Competitorn/a
Meas. Tech.ChEMBL_321623 (CHEMBL871632)
IC50 4.7±n/a nM
Citation Ulven, TFrimurer, TMReceveur, JMLittle, PBRist, ONørregaard, PKHögberg, T 6-Acylamino-2-aminoquinolines as potent melanin-concentrating hormone 1 receptor antagonists. Identification, structure-activity relationship, and investigation of binding mode. J Med Chem48:5684-97 (2005) 
 
Melanin-concentrating hormone receptor 2
Name:Melanin-concentrating hormone receptor 2
Type:Enzyme Catalytic Domain
Mol. Mass.:38862.16
Organism:Homo sapiens (Human)
Description:Melanin Concentrating Hormone 2 GPR145 HUMAN::Q969V1
Residue:340
BDBM50172425
NameBDBM50172425
Synonyms:CHEMBL197026 | N-[2-(4-Amino-piperidin-1-yl)-4-methyl-quinolin-6-yl]-2-(4-trifluoromethoxy-phenoxy)-acetamide
TypeSmall organic molecule
Emp. Form.C24H25F3N4O3
Mol. Mass.474.4755
SMILESCc1cc(nc2ccc(NC(=O)COc3ccc(OC(F)(F)F)cc3)cc12)N1CCC(N)CC1