Reaction Details
Target5-hydroxytryptamine receptor 2C
LigandBDBM50172413
Substrate/Competitorn/a
Meas. Tech.ChEMBL_321575 (CHEMBL881790)
IC50 770±n/a nM
Citation Ulven, TFrimurer, TMReceveur, JMLittle, PBRist, ONørregaard, PKHögberg, T 6-Acylamino-2-aminoquinolines as potent melanin-concentrating hormone 1 receptor antagonists. Identification, structure-activity relationship, and investigation of binding mode. J Med Chem48:5684-97 (2005) 
 
5-hydroxytryptamine receptor 2C
Name:5-hydroxytryptamine receptor 2C
Type:G Protein-Coupled Receptor (GPCR)
Mol. Mass.:51836.79
Organism:Homo sapiens (Human)
Description:P28335
Residue:458
BDBM50172413
NameBDBM50172413
Synonyms:2-(2,4-Dichloro-phenoxy)-N-{4-methyl-2-[methyl-(2-methylamino-ethyl)-amino]-quinolin-6-yl}-acetamide | CHEMBL373084
TypeSmall organic molecule
Emp. Form.C22H24Cl2N4O2
Mol. Mass.447.358
SMILESCNCCN(C)c1cc(C)c2cc(NC(=O)COc3ccc(Cl)cc3Cl)ccc2n1