Reaction Details
TargetMelanin-concentrating hormone receptor 1
LigandBDBM50172413
Substrate/Competitorn/a
Meas. Tech.ChEMBL_321618 (CHEMBL871627)
IC50 6.1±n/a nM
Citation Ulven, TFrimurer, TMReceveur, JMLittle, PBRist, ONørregaard, PKHögberg, T 6-Acylamino-2-aminoquinolines as potent melanin-concentrating hormone 1 receptor antagonists. Identification, structure-activity relationship, and investigation of binding mode. J Med Chem48:5684-97 (2005) 
 
Melanin-concentrating hormone receptor 1
Name:Melanin-concentrating hormone receptor 1
Type:G Protein-Coupled Receptor (GPCR)
Mol. Mass.:45976.27
Organism:Homo sapiens (Human)
Description:Membranes from CHO-K1 cells stably expressing human MCH1R were used in assays.
Residue:422
BDBM50172413
NameBDBM50172413
Synonyms:2-(2,4-Dichloro-phenoxy)-N-{4-methyl-2-[methyl-(2-methylamino-ethyl)-amino]-quinolin-6-yl}-acetamide | CHEMBL373084
TypeSmall organic molecule
Emp. Form.C22H24Cl2N4O2
Mol. Mass.447.358
SMILESCNCCN(C)c1cc(C)c2cc(NC(=O)COc3ccc(Cl)cc3Cl)ccc2n1