Reaction Details
TargetMelanin-concentrating hormone receptor 2
LigandBDBM50172432
Substrate/Competitorn/a
Meas. Tech.ChEMBL_321623 (CHEMBL871632)
IC50 4.5±n/a nM
Citation Ulven, TFrimurer, TMReceveur, JMLittle, PBRist, ONørregaard, PKHögberg, T 6-Acylamino-2-aminoquinolines as potent melanin-concentrating hormone 1 receptor antagonists. Identification, structure-activity relationship, and investigation of binding mode. J Med Chem48:5684-97 (2005) 
 
Melanin-concentrating hormone receptor 2
Name:Melanin-concentrating hormone receptor 2
Type:Enzyme Catalytic Domain
Mol. Mass.:38862.16
Organism:Homo sapiens (Human)
Description:Melanin Concentrating Hormone 2 GPR145 HUMAN::Q969V1
Residue:340
BDBM50172432
NameBDBM50172432
Synonyms:2-(2,4-Dichloro-phenoxy)-N-{2-[(2-dimethylamino-ethyl)-methyl-amino]-4-methyl-quinolin-6-yl}-acetamide | CHEMBL194408
TypeSmall organic molecule
Emp. Form.C23H26Cl2N4O2
Mol. Mass.461.384
SMILESCN(C)CCN(C)c1cc(C)c2cc(NC(=O)COc3ccc(Cl)cc3Cl)ccc2n1