Reaction Details
Target5-hydroxytryptamine receptor 2C
LigandBDBM50172415
Substrate/Competitorn/a
Meas. Tech.ChEMBL_321575 (CHEMBL881790)
IC50 5900±n/a nM
Citation Ulven, TFrimurer, TMReceveur, JMLittle, PBRist, ONørregaard, PKHögberg, T 6-Acylamino-2-aminoquinolines as potent melanin-concentrating hormone 1 receptor antagonists. Identification, structure-activity relationship, and investigation of binding mode. J Med Chem48:5684-97 (2005) 
 
5-hydroxytryptamine receptor 2C
Name:5-hydroxytryptamine receptor 2C
Type:G Protein-Coupled Receptor (GPCR)
Mol. Mass.:51836.79
Organism:Homo sapiens (Human)
Description:P28335
Residue:458
BDBM50172415
NameBDBM50172415
Synonyms:2-(2,4-Dichloro-phenoxy)-N-{2-[(2-hydroxy-ethyl)-methyl-amino]-4-methyl-quinolin-6-yl}-acetamide | CHEMBL197245
TypeSmall organic molecule
Emp. Form.C21H21Cl2N3O3
Mol. Mass.434.316
SMILESCN(CCO)c1cc(C)c2cc(NC(=O)COc3ccc(Cl)cc3Cl)ccc2n1