Reaction Details
TargetMelanin-concentrating hormone receptor 1
LigandBDBM50172434
Substrate/Competitorn/a
Meas. Tech.ChEMBL_321621 (CHEMBL871630)
IC50 29±n/a nM
Citation Ulven, TFrimurer, TMReceveur, JMLittle, PBRist, ONørregaard, PKHögberg, T 6-Acylamino-2-aminoquinolines as potent melanin-concentrating hormone 1 receptor antagonists. Identification, structure-activity relationship, and investigation of binding mode. J Med Chem48:5684-97 (2005) 
 
Melanin-concentrating hormone receptor 1
Name:Melanin-concentrating hormone receptor 1
Type:G Protein-Coupled Receptor (GPCR)
Mol. Mass.:45976.27
Organism:Homo sapiens (Human)
Description:Membranes from CHO-K1 cells stably expressing human MCH1R were used in assays.
Residue:422
BDBM50172434
NameBDBM50172434
Synonyms:Acetic acid 2-({6-[2-(3,4-dichloro-phenoxy)-acetylamino]-4-methyl-quinolin-2-yl}-methyl-amino)-ethyl ester | CHEMBL196567
TypeSmall organic molecule
Emp. Form.C23H23Cl2N3O4
Mol. Mass.476.352
SMILESCN(CCOC(C)=O)c1cc(C)c2cc(NC(=O)COc3ccc(Cl)cc3Cl)ccc2n1