Reaction Details
Target5-hydroxytryptamine receptor 2C
LigandBDBM50172436
Substrate/Competitorn/a
Meas. Tech.ChEMBL_321575 (CHEMBL881790)
IC50 1600±n/a nM
Citation Ulven, TFrimurer, TMReceveur, JMLittle, PBRist, ONørregaard, PKHögberg, T 6-Acylamino-2-aminoquinolines as potent melanin-concentrating hormone 1 receptor antagonists. Identification, structure-activity relationship, and investigation of binding mode. J Med Chem48:5684-97 (2005) 
 
5-hydroxytryptamine receptor 2C
Name:5-hydroxytryptamine receptor 2C
Type:G Protein-Coupled Receptor (GPCR)
Mol. Mass.:51836.79
Organism:Homo sapiens (Human)
Description:P28335
Residue:458
BDBM50172436
NameBDBM50172436
Synonyms:(E)-N-(2-[1,4]Diazepan-1-yl-4-methyl-quinolin-6-yl)-3-(4-trifluoromethoxy-phenyl)-acrylamide | CHEMBL193473
TypeSmall organic molecule
Emp. Form.C25H25F3N4O2
Mol. Mass.470.4868
SMILESCc1cc(nc2ccc(NC(=O)\C=C\c3ccc(OC(F)(F)F)cc3)cc12)N1CCCNCC1