Reaction Details
TargetD(1A) dopamine receptor
LigandBDBM50172414
Substrate/Competitorn/a
Meas. Tech.ChEMBL_321256 (CHEMBL881881)
IC50 7.5±n/a nM
Citation Ulven, TFrimurer, TMReceveur, JMLittle, PBRist, ONørregaard, PKHögberg, T 6-Acylamino-2-aminoquinolines as potent melanin-concentrating hormone 1 receptor antagonists. Identification, structure-activity relationship, and investigation of binding mode. J Med Chem48:5684-97 (2005) 
 
D(1A) dopamine receptor
Name:D(1A) dopamine receptor
Type:Enzyme
Mol. Mass.:49303.43
Organism:Homo sapiens (Human)
Description:P21728
Residue:446
BDBM50172414
NameBDBM50172414
Synonyms:2-(2,4-Dichloro-phenoxy)-N-[2-(2-dimethylamino-ethoxy)-4-methyl-quinolin-6-yl]-acetamide | CHEMBL194837
TypeSmall organic molecule
Emp. Form.C22H23Cl2N3O3
Mol. Mass.448.342
SMILESCN(C)CCOc1cc(C)c2cc(NC(=O)COc3ccc(Cl)cc3Cl)ccc2n1