Reaction Details
TargetMelanin-concentrating hormone receptor 1
LigandBDBM50172426
Substrate/Competitorn/a
Meas. Tech.ChEMBL_321621 (CHEMBL871630)
IC50 22±n/a nM
Citation Ulven, TFrimurer, TMReceveur, JMLittle, PBRist, ONørregaard, PKHögberg, T 6-Acylamino-2-aminoquinolines as potent melanin-concentrating hormone 1 receptor antagonists. Identification, structure-activity relationship, and investigation of binding mode. J Med Chem48:5684-97 (2005) 
 
Melanin-concentrating hormone receptor 1
Name:Melanin-concentrating hormone receptor 1
Type:G Protein-Coupled Receptor (GPCR)
Mol. Mass.:45976.27
Organism:Homo sapiens (Human)
Description:Membranes from CHO-K1 cells stably expressing human MCH1R were used in assays.
Residue:422
BDBM50172426
NameBDBM50172426
Synonyms:(E)-N-[2-(2-Dimethylamino-1-methyl-ethylamino)-4-methyl-quinolin-6-yl]-3-(4-trifluoromethoxy-phenyl)-acrylamide | CHEMBL194046
TypeSmall organic molecule
Emp. Form.C25H27F3N4O2
Mol. Mass.472.5027
SMILESCC(CN(C)C)Nc1cc(C)c2cc(NC(=O)\C=C\c3ccc(OC(F)(F)F)cc3)ccc2n1