Reaction Details
TargetMelanin-concentrating hormone receptor 1
LigandBDBM50172429
Substrate/Competitorn/a
Meas. Tech.ChEMBL_321621 (CHEMBL871630)
IC50 97±n/a nM
Citation Ulven, TFrimurer, TMReceveur, JMLittle, PBRist, ONørregaard, PKHögberg, T 6-Acylamino-2-aminoquinolines as potent melanin-concentrating hormone 1 receptor antagonists. Identification, structure-activity relationship, and investigation of binding mode. J Med Chem48:5684-97 (2005) 
 
Melanin-concentrating hormone receptor 1
Name:Melanin-concentrating hormone receptor 1
Type:G Protein-Coupled Receptor (GPCR)
Mol. Mass.:45976.27
Organism:Homo sapiens (Human)
Description:Membranes from CHO-K1 cells stably expressing human MCH1R were used in assays.
Residue:422
BDBM50172429
NameBDBM50172429
Synonyms:CHEMBL370120 | N-(4-Methyl-2-piperidin-1-yl-quinolin-6-yl)-2-(4-trifluoromethoxy-phenoxy)-acetamide
TypeSmall organic molecule
Emp. Form.C24H24F3N3O3
Mol. Mass.459.4609
SMILESCc1cc(nc2ccc(NC(=O)COc3ccc(OC(F)(F)F)cc3)cc12)N1CCCCC1