Reaction Details
Target5-hydroxytryptamine receptor 2C
LigandBDBM50172442
Substrate/Competitorn/a
Meas. Tech.ChEMBL_321575 (CHEMBL881790)
IC50 5700±n/a nM
Citation Ulven, TFrimurer, TMReceveur, JMLittle, PBRist, ONørregaard, PKHögberg, T 6-Acylamino-2-aminoquinolines as potent melanin-concentrating hormone 1 receptor antagonists. Identification, structure-activity relationship, and investigation of binding mode. J Med Chem48:5684-97 (2005) 
 
5-hydroxytryptamine receptor 2C
Name:5-hydroxytryptamine receptor 2C
Type:G Protein-Coupled Receptor (GPCR)
Mol. Mass.:51836.79
Organism:Homo sapiens (Human)
Description:P28335
Residue:458
BDBM50172442
NameBDBM50172442
Synonyms:(E)-N-[2-(2-Dimethylamino-ethylamino)-4-methyl-quinolin-6-yl]-3-(4-trifluoromethoxy-phenyl)-acrylamide | CHEMBL196196
TypeSmall organic molecule
Emp. Form.C24H25F3N4O2
Mol. Mass.458.4761
SMILESCN(C)CCNc1cc(C)c2cc(NC(=O)\C=C\c3ccc(OC(F)(F)F)cc3)ccc2n1