Reaction Details
TargetMelanin-concentrating hormone receptor 1
LigandBDBM50172456
Substrate/Competitorn/a
Meas. Tech.ChEMBL_321621 (CHEMBL871630)
IC50 224±n/a nM
Citation Ulven, TFrimurer, TMReceveur, JMLittle, PBRist, ONørregaard, PKHögberg, T 6-Acylamino-2-aminoquinolines as potent melanin-concentrating hormone 1 receptor antagonists. Identification, structure-activity relationship, and investigation of binding mode. J Med Chem48:5684-97 (2005) 
 
Melanin-concentrating hormone receptor 1
Name:Melanin-concentrating hormone receptor 1
Type:G Protein-Coupled Receptor (GPCR)
Mol. Mass.:45976.27
Organism:Homo sapiens (Human)
Description:Membranes from CHO-K1 cells stably expressing human MCH1R were used in assays.
Residue:422
BDBM50172456
NameBDBM50172456
Synonyms:CHEMBL371576 | N-(4-Fluoro-phenyl)-N-methyl-N'-[4-methyl-2-(4-methyl-piperazin-1-yl)-quinolin-6-yl]-succinamide
TypeSmall organic molecule
Emp. Form.C25H28FN5O2
Mol. Mass.449.5205
SMILESCN1CCN(CC1)c1cc(C)c2cc(NC(=O)CCC(=O)Nc3ccc(F)cc3)ccc2n1