Reaction Details
TargetAmyloid-beta precursor protein
LigandBDBM50172463
Substrate/Competitorn/a
Meas. Tech.ChEMBL_322428 (CHEMBL873550)
IC50 111000±n/a nM
Citation Peretto, IRadaelli, SParini, CZandi, MRaveglia, LFDondio, GFontanella, LMisiano, PBigogno, CRizzi, ARiccardi, BBiscaioli, MMarchetti, SPuccini, PCatinella, SRondelli, ICenacchi, VBolzoni, PTCaruso, PVilletti, GFacchinetti, FDel Giudice, EMoretto, NImbimbo, BP Synthesis and biological activity of flurbiprofen analogues as selective inhibitors of beta-amyloid(1)(-)(42) secretion. J Med Chem48:5705-20 (2005) 
 
Amyloid-beta precursor protein
Name:Amyloid-beta precursor protein
Type:Single-pass type I membrane protein
Mol. Mass.:86890.41
Organism:Homo sapiens (Human)
Description:P05067
Residue:770
BDBM50172463
NameBDBM50172463
Synonyms:1-(2-Fluoro-4'-trifluoromethyl-biphenyl-4-yl)-cyclopropanecarboxylic acid | CHEMBL196246
TypeSmall organic molecule
Emp. Form.C17H12F4O2
Mol. Mass.324.2696
SMILESOC(=O)C1(CC1)c1ccc(c(F)c1)-c1ccc(cc1)C(F)(F)F