Reaction Details
TargetCytochrome P450 3A4
LigandBDBM50172466
Substrate/Competitorn/a
Meas. Tech.ChEMBL_322414 (CHEMBL871890)
IC50 74000±n/a nM
Citation Peretto, IRadaelli, SParini, CZandi, MRaveglia, LFDondio, GFontanella, LMisiano, PBigogno, CRizzi, ARiccardi, BBiscaioli, MMarchetti, SPuccini, PCatinella, SRondelli, ICenacchi, VBolzoni, PTCaruso, PVilletti, GFacchinetti, FDel Giudice, EMoretto, NImbimbo, BP Synthesis and biological activity of flurbiprofen analogues as selective inhibitors of beta-amyloid(1)(-)(42) secretion. J Med Chem48:5705-20 (2005) 
 
Cytochrome P450 3A4
Name:Cytochrome P450 3A4
Type:Enzyme
Mol. Mass.:57349.57
Organism:Homo sapiens (Human)
Description:n/a
Residue:503
BDBM50172466
NameBDBM50172466
Synonyms:2-(2-Fluoro-4''-hydroxy-[1,1';4',1'']terphenyl-4-yl)-propionic acid | CHEMBL197202
TypeSmall organic molecule
Emp. Form.C21H17FO3
Mol. Mass.336.3563
SMILESCC(C(O)=O)c1ccc(c(F)c1)-c1ccc(cc1)-c1ccc(O)cc1