Reaction Details
TargetAmyloid-beta precursor protein
LigandBDBM50172472
Substrate/Competitorn/a
Meas. Tech.ChEMBL_322428 (CHEMBL873550)
IC50 64000±n/a nM
Citation Peretto, IRadaelli, SParini, CZandi, MRaveglia, LFDondio, GFontanella, LMisiano, PBigogno, CRizzi, ARiccardi, BBiscaioli, MMarchetti, SPuccini, PCatinella, SRondelli, ICenacchi, VBolzoni, PTCaruso, PVilletti, GFacchinetti, FDel Giudice, EMoretto, NImbimbo, BP Synthesis and biological activity of flurbiprofen analogues as selective inhibitors of beta-amyloid(1)(-)(42) secretion. J Med Chem48:5705-20 (2005) 
 
Amyloid-beta precursor protein
Name:Amyloid-beta precursor protein
Type:Single-pass type I membrane protein
Mol. Mass.:86890.41
Organism:Homo sapiens (Human)
Description:P05067
Residue:770
BDBM50172472
NameBDBM50172472
Synonyms:2-(3',5'-Dichloro-2-fluoro-biphenyl-4-yl)-propionamide | CHEMBL193900
TypeSmall organic molecule
Emp. Form.C15H12Cl2FNO
Mol. Mass.312.166
SMILESCC(C(N)=O)c1ccc(c(F)c1)-c1cc(Cl)cc(Cl)c1