Reaction Details
TargetAmyloid-beta precursor protein
LigandBDBM50172482
Substrate/Competitorn/a
Meas. Tech.ChEMBL_322428 (CHEMBL873550)
IC50 41000±n/a nM
Citation Peretto, IRadaelli, SParini, CZandi, MRaveglia, LFDondio, GFontanella, LMisiano, PBigogno, CRizzi, ARiccardi, BBiscaioli, MMarchetti, SPuccini, PCatinella, SRondelli, ICenacchi, VBolzoni, PTCaruso, PVilletti, GFacchinetti, FDel Giudice, EMoretto, NImbimbo, BP Synthesis and biological activity of flurbiprofen analogues as selective inhibitors of beta-amyloid(1)(-)(42) secretion. J Med Chem48:5705-20 (2005) 
 
Amyloid-beta precursor protein
Name:Amyloid-beta precursor protein
Type:Single-pass type I membrane protein
Mol. Mass.:86890.41
Organism:Homo sapiens (Human)
Description:P05067
Residue:770
BDBM50172482
NameBDBM50172482
Synonyms:1-(3',4'-Dichloro-2-fluoro-biphenyl-4-yl)-cyclopropanecarboxylic acid | CHEMBL196945
TypeSmall organic molecule
Emp. Form.C16H11Cl2FO2
Mol. Mass.325.162
SMILESOC(=O)C1(CC1)c1ccc(c(F)c1)-c1ccc(Cl)c(Cl)c1