Reaction Details
TargetAmyloid-beta precursor protein
LigandBDBM50172476
Substrate/Competitorn/a
Meas. Tech.ChEMBL_322428 (CHEMBL873550)
IC50 67000±n/a nM
Citation Peretto, IRadaelli, SParini, CZandi, MRaveglia, LFDondio, GFontanella, LMisiano, PBigogno, CRizzi, ARiccardi, BBiscaioli, MMarchetti, SPuccini, PCatinella, SRondelli, ICenacchi, VBolzoni, PTCaruso, PVilletti, GFacchinetti, FDel Giudice, EMoretto, NImbimbo, BP Synthesis and biological activity of flurbiprofen analogues as selective inhibitors of beta-amyloid(1)(-)(42) secretion. J Med Chem48:5705-20 (2005) 
 
Amyloid-beta precursor protein
Name:Amyloid-beta precursor protein
Type:Single-pass type I membrane protein
Mol. Mass.:86890.41
Organism:Homo sapiens (Human)
Description:P05067
Residue:770
BDBM50172476
NameBDBM50172476
Synonyms:2-(2-Fluoro-4'-methoxy-biphenyl-4-yl)-propionic acid | CHEMBL196321
TypeSmall organic molecule
Emp. Form.C16H15FO3
Mol. Mass.274.2869
SMILESCOc1ccc(cc1)-c1ccc(cc1F)C(C)C(O)=O