Reaction Details
TargetAmyloid-beta precursor protein
LigandBDBM50172475
Substrate/Competitorn/a
Meas. Tech.ChEMBL_322428 (CHEMBL873550)
IC50 21000±n/a nM
Citation Peretto, IRadaelli, SParini, CZandi, MRaveglia, LFDondio, GFontanella, LMisiano, PBigogno, CRizzi, ARiccardi, BBiscaioli, MMarchetti, SPuccini, PCatinella, SRondelli, ICenacchi, VBolzoni, PTCaruso, PVilletti, GFacchinetti, FDel Giudice, EMoretto, NImbimbo, BP Synthesis and biological activity of flurbiprofen analogues as selective inhibitors of beta-amyloid(1)(-)(42) secretion. J Med Chem48:5705-20 (2005) 
 
Amyloid-beta precursor protein
Name:Amyloid-beta precursor protein
Type:Single-pass type I membrane protein
Mol. Mass.:86890.41
Organism:Homo sapiens (Human)
Description:P05067
Residue:770
BDBM50172475
NameBDBM50172475
Synonyms:2-(4'-Cyclohexyl-2-fluoro-biphenyl-4-yl)-propionic acid | CHEMBL264006
TypeSmall organic molecule
Emp. Form.C21H23FO2
Mol. Mass.326.4045
SMILESCC(C(O)=O)c1ccc(c(F)c1)-c1ccc(cc1)C1CCCCC1