Reaction Details
TargetCytochrome P450 2C9
LigandBDBM50172481
Substrate/Competitorn/a
Meas. Tech.ChEMBL_322412 (CHEMBL871888)
IC50 28000±n/a nM
Citation Peretto, IRadaelli, SParini, CZandi, MRaveglia, LFDondio, GFontanella, LMisiano, PBigogno, CRizzi, ARiccardi, BBiscaioli, MMarchetti, SPuccini, PCatinella, SRondelli, ICenacchi, VBolzoni, PTCaruso, PVilletti, GFacchinetti, FDel Giudice, EMoretto, NImbimbo, BP Synthesis and biological activity of flurbiprofen analogues as selective inhibitors of beta-amyloid(1)(-)(42) secretion. J Med Chem48:5705-20 (2005) 
 
Cytochrome P450 2C9
Name:Cytochrome P450 2C9
Type:Enzyme
Mol. Mass.:55636.33
Organism:Homo sapiens (Human)
Description:P11712
Residue:490
BDBM50172481
NameBDBM50172481
Synonyms:2-(4'-Cyclohexyl-2-fluoro-biphenyl-4-yl)-2-methyl-propionic acid | CHEMBL364738
TypeSmall organic molecule
Emp. Form.C22H25FO2
Mol. Mass.340.4311
SMILESCC(C)(C(O)=O)c1ccc(c(F)c1)-c1ccc(cc1)C1CCCCC1