Reaction Details
TargetAmyloid-beta precursor protein
LigandBDBM50172461
Substrate/Competitorn/a
Meas. Tech.ChEMBL_322428 (CHEMBL873550)
IC50 33600±n/a nM
Citation Peretto, IRadaelli, SParini, CZandi, MRaveglia, LFDondio, GFontanella, LMisiano, PBigogno, CRizzi, ARiccardi, BBiscaioli, MMarchetti, SPuccini, PCatinella, SRondelli, ICenacchi, VBolzoni, PTCaruso, PVilletti, GFacchinetti, FDel Giudice, EMoretto, NImbimbo, BP Synthesis and biological activity of flurbiprofen analogues as selective inhibitors of beta-amyloid(1)(-)(42) secretion. J Med Chem48:5705-20 (2005) 
 
Amyloid-beta precursor protein
Name:Amyloid-beta precursor protein
Type:Single-pass type I membrane protein
Mol. Mass.:86890.41
Organism:Homo sapiens (Human)
Description:P05067
Residue:770
BDBM50172461
NameBDBM50172461
Synonyms:1-(2',2''-Difluoro-4-hydroxy-[1,1';4',1'']terphenyl-4''-yl)-cyclopropanecarboxylic acid | CHEMBL372846
TypeSmall organic molecule
Emp. Form.C22H16F2O3
Mol. Mass.366.3574
SMILESOC(=O)C1(CC1)c1ccc(c(F)c1)-c1ccc(c(F)c1)-c1ccc(O)cc1