Reaction Details
TargetProtein kinase C alpha type
LigandBDBM50107112
Substrate/Competitorn/a
Meas. Tech.ChEMBL_320900 (CHEMBL872399)
pH7.4±n/a
Ki 2.9±n/a nM
Commentsextracted
Citation Kang, JHPeach, MLPu, YLewin, NENicklaus, MCBlumberg, PMMarquez, VE Conformationally constrained analogues of diacylglycerol (DAG). 25. Exploration of the sn-1 and sn-2 carbonyl functionality reveals the essential role of the sn-1 carbonyl at the lipid interface in the binding of DAG-lactones to protein kinase C. J Med Chem48:5738-48 (2005) 
 
Protein kinase C alpha type
Name:Protein kinase C alpha type
Type:Enzyme
Mol. Mass.:76755.65
Organism:Homo sapiens (Human)
Description:The recombinant human PKC enzymes were produced using a baculovirus expression system in SF9 cells
Residue:672
BDBM50107112
NameBDBM50107112
Synonyms:(Z) 2,2-Dimethyl-propionic acid 2-hydroxymethyl-4-(3-isobutyl-5-methyl-hexylidene)-5-oxo-tetrahydro-furan-2-ylmethyl ester (Z)-2-(2-(hydroxymethyl)-4-(3-isobutyl-5-methylhexylidene)-5-oxo-tetrahydrofuran-2-yl)ethyl pivalate 2,2-Dimethyl-propionic acid 2-hydroxymethyl-4-[3-isobutyl-5-methyl-hex-(Z)-ylidene]-5-oxo-tetrahydro-furan-2-ylmethyl ester DAG-lactone (HK-434)
TypeSmall organic molecule
Emp. Form.C22H38O5
Mol. Mass.382.5341
SMILESCC(C)CC(C\C=C1\CC(CO)(COC(=O)C(C)(C)C)OC1=O)CC(C)C