Reaction Details
TargetReverse transcriptase/RNaseH
LigandBDBM50172746
Substrate/Competitorn/a
Meas. Tech.ChEMBL_321416 (CHEMBL881947)
IC50 500±n/a nM
Citation Bedoya, LMBeltrán, MSancho, ROlmedo, DASánchez-Palomino, Sdel Olmo, ELópez-Pérez, JLMuñoz, ESan Feliciano, AAlcamí, J 4-Phenylcoumarins as HIV transcription inhibitors. Bioorg Med Chem Lett15:4447-50 (2005) 
 
Reverse transcriptase/RNaseH
Name:Reverse transcriptase/RNaseH
Type:PROTEIN
Mol. Mass.:65229.15
Organism:Human immunodeficiency virus 1
Description:ChEMBL_1473730
Residue:566
BDBM50172746
NameBDBM50172746
Synonyms:5,7-Dihydroxy-8-(2-hydroxy-3-methyl-but-2-enyl)-6-(3-methyl-butyryl)-4-phenyl-chromen-2-one | CHEMBL199090
TypeSmall organic molecule
Emp. Form.C25H26O6
Mol. Mass.422.4703
SMILESCC(C)CC(=O)c1c(O)c(CC(=O)C(C)C)c2oc(=O)cc(-c3ccccc3)c2c1O