Reaction Details
TargetReverse transcriptase/RNaseH
LigandBDBM50172745
Substrate/Competitorn/a
Meas. Tech.ChEMBL_321416 (CHEMBL881947)
IC50 11200±n/a nM
Citation Bedoya, LMBeltrán, MSancho, ROlmedo, DASánchez-Palomino, Sdel Olmo, ELópez-Pérez, JLMuñoz, ESan Feliciano, AAlcamí, J 4-Phenylcoumarins as HIV transcription inhibitors. Bioorg Med Chem Lett15:4447-50 (2005) 
 
Reverse transcriptase/RNaseH
Name:Reverse transcriptase/RNaseH
Type:PROTEIN
Mol. Mass.:65229.15
Organism:Human immunodeficiency virus 1
Description:ChEMBL_1473730
Residue:566
BDBM50172745
NameBDBM50172745
Synonyms:5,7-Dihydroxy-8-(3-methyl-but-2-enyl)-4-phenyl-chromen-2-one CHEMBL363624
TypeSmall organic molecule
Emp. Form.C20H18O4
Mol. Mass.322.3545
SMILES[#6]\[#6](-[#6])=[#6]\[#6]-c1c(-[#8])cc(-[#8])c2c(cc(=O)oc12)-c1ccccc1