Reaction Details
TargetAmine oxidase [flavin-containing] B
LigandBDBM15579
Substrate/Competitorn/a
Meas. Tech.ChEMBL_320782 (CHEMBL884737)
Ki 970±n/a nM
Citation Toprakçí, MYelekçi, K Docking studies on monoamine oxidase-B inhibitors: estimation of inhibition constants (K(i)) of a series of experimentally tested compounds. Bioorg Med Chem Lett15:4438-46 (2005) 
 
Amine oxidase [flavin-containing] B
Name:Amine oxidase [flavin-containing] B
Type:Protein
Mol. Mass.:58768.76
Organism:Homo sapiens (Human)
Description:P27338
Residue:520
BDBM15579
NameBDBM15579
Synonyms:CHEMBL972 L-Deprenyl SLG US8633208, Deprenyl methyl[(2R)-1-phenylpropan-2-yl]prop-2-yn-1-ylamine
TypeSmall organic molecule
Emp. Form.C13H17N
Mol. Mass.187.2808
SMILESC[C@H](Cc1ccccc1)N(C)CC#C