Reaction Details
TargetProthrombin
LigandBDBM50172833
Substrate/Competitorn/a
Meas. Tech.ChEMBL_320755 (CHEMBL884569)
Ki 3.1±n/a nM
Citation Deng, JZMcMasters, DRRabbat, PMWilliams, PDCoburn, CAYan, YKuo, LCLewis, SDLucas, BJKrueger, JAStrulovici, BVacca, JPLyle, TABurgey, CS Development of an oxazolopyridine series of dual thrombin/factor Xa inhibitors via structure-guided lead optimization. Bioorg Med Chem Lett15:4411-6 (2005) 
 
Prothrombin
Name:Prothrombin
Type:Protein
Mol. Mass.:70029.57
Organism:Homo sapiens (Human)
Description:P00734
Residue:622
BDBM50172833
NameBDBM50172833
Synonyms:CHEMBL198071 | [2-(3-Chloro-benzyl)-6-methyl-oxazolo[4,5-c]pyridin-4-yl]-(2-piperidin-2-yl-ethyl)-amine
TypeSmall organic molecule
Emp. Form.C21H25ClN4O
Mol. Mass.384.902
SMILESCc1cc2oc(Cc3cccc(Cl)c3)nc2c(NCCC2CCCCN2)n1