Reaction Details
TargetTissue-type plasminogen activator
LigandBDBM50172831
Substrate/Competitorn/a
Meas. Tech.ChEMBL_320806 (CHEMBL884761)
Ki 100±n/a nM
Citation Deng, JZMcMasters, DRRabbat, PMWilliams, PDCoburn, CAYan, YKuo, LCLewis, SDLucas, BJKrueger, JAStrulovici, BVacca, JPLyle, TABurgey, CS Development of an oxazolopyridine series of dual thrombin/factor Xa inhibitors via structure-guided lead optimization. Bioorg Med Chem Lett15:4411-6 (2005) 
 
Tissue-type plasminogen activator
Name:Tissue-type plasminogen activator
Type:Enzyme
Mol. Mass.:62931.08
Organism:Homo sapiens (Human)
Description:n/a
Residue:562
BDBM50172831
NameBDBM50172831
Synonyms:CHEMBL198978 | [2-(5-Chloro-2-[1,2,4]triazol-1-yl-benzyl)-oxazolo[4,5-c]pyridin-4-yl]-[2-(1-phenyl-piperidin-2-yl)-ethyl]-amine
TypeSmall organic molecule
Emp. Form.C29H30ClN7O
Mol. Mass.528.048
SMILESClc1ccc(c(Cc2nc3c(NCCC4CCCCN4Cc4ccccc4)nccc3o2)c1)-n1cncn1