Reaction Details
TargetProthrombin
LigandBDBM50172836
Substrate/Competitorn/a
Meas. Tech.ChEMBL_320755 (CHEMBL884569)
Ki 2.1±n/a nM
Citation Deng, JZMcMasters, DRRabbat, PMWilliams, PDCoburn, CAYan, YKuo, LCLewis, SDLucas, BJKrueger, JAStrulovici, BVacca, JPLyle, TABurgey, CS Development of an oxazolopyridine series of dual thrombin/factor Xa inhibitors via structure-guided lead optimization. Bioorg Med Chem Lett15:4411-6 (2005) 
 
Prothrombin
Name:Prothrombin
Type:Protein
Mol. Mass.:70029.57
Organism:Homo sapiens (Human)
Description:P00734
Residue:622
BDBM50172836
NameBDBM50172836
Synonyms:(2,2-Difluoro-2-pyridin-2-yl-ethyl)-[2-(2-tetrazol-1-yl-benzyl)-benzooxazol-4-yl]-amine | CHEMBL198002
TypeSmall organic molecule
Emp. Form.C22H17F2N7O
Mol. Mass.433.4135
SMILESFC(F)(CNc1cccc2oc(Cc3ccccc3-n3cnnn3)nc12)c1ccccn1