Reaction Details
TargetProthrombin
LigandBDBM50172849
Substrate/Competitorn/a
Meas. Tech.ChEMBL_320755 (CHEMBL884569)
Ki 7.8±n/a nM
Citation Deng, JZMcMasters, DRRabbat, PMWilliams, PDCoburn, CAYan, YKuo, LCLewis, SDLucas, BJKrueger, JAStrulovici, BVacca, JPLyle, TABurgey, CS Development of an oxazolopyridine series of dual thrombin/factor Xa inhibitors via structure-guided lead optimization. Bioorg Med Chem Lett15:4411-6 (2005) 
 
Prothrombin
Name:Prothrombin
Type:Protein
Mol. Mass.:70029.57
Organism:Homo sapiens (Human)
Description:P00734
Residue:622
BDBM50172849
NameBDBM50172849
Synonyms:CHEMBL194560 | [2-(3-Chloro-benzyl)-6-methyl-oxazolo[4,5-c]pyridin-4-yl]-(2,2-difluoro-2-pyridin-2-yl-ethyl)-amine
TypeSmall organic molecule
Emp. Form.C21H17ClF2N4O
Mol. Mass.414.836
SMILESCc1cc2oc(Cc3cccc(Cl)c3)nc2c(NCC(F)(F)c2ccccn2)n1